Resource
type: Class
description: represents a file that can be shared
subclass of: Work

available
type: Property
description: points to a URL where the file is available
domain: Resource
range: resource

checksum
type: Property
description: sha1 checksum
domain: Resource